• In diretta da GamesVillage.it
    • News
    • -
    • In Evidenza
    • -
    • Recensioni
    • -
    • RetroGaming
    • -
    • Anteprime
    • -
    • Video
    • -
    • Cinema

Visualizzazione risultati da 1 a 5 di 5

Discussione: Installazione Superkaramba

Cambio titolo
  1. #1
    Fighting with Mandrake L'avatar di Dark Ares
    Registrato il
    01-04
    LocalitÓ
    Russia
    Messaggi
    864

    Installazione Superkaramba

    ho installato karamba secondo le insdicazioni della faq della dir doc. l'output e' il seguente:
    [[email protected] super]# ./configure --prefix=/usr
    checking build system type... i686-pc-linux-gnu
    checking host system type... i686-pc-linux-gnu
    checking target system type... i686-pc-linux-gnu
    checking for a BSD-compatible install... /usr/bin/install -c
    checking for -p flag to install... yes
    checking whether build environment is sane... yes
    checking for gawk... gawk
    checking whether make sets $(MAKE)... yes
    checking for style of include used by make... GNU
    checking for gcc... gcc
    checking for C compiler default output file name... a.out
    checking whether the C compiler works... yes
    checking whether we are cross compiling... no
    checking for suffix of executables...
    checking for suffix of object files... o
    checking whether we are using the GNU C compiler... yes
    checking whether gcc accepts -g... yes
    checking for gcc option to accept ANSI C... none needed
    checking dependency style of gcc... gcc3
    checking how to run the C preprocessor... gcc -E
    checking for g++... g++
    checking whether we are using the GNU C++ compiler... yes
    checking whether g++ accepts -g... yes
    checking dependency style of g++... gcc3
    checking whether g++ supports -Wundef... yes
    checking whether g++ supports -Wno-long-long... yes
    checking whether g++ supports -Wnon-virtual-dtor... yes
    checking whether g++ supports -fno-exceptions... yes
    checking whether g++ supports -fno-check-new... yes
    checking whether g++ supports -fexceptions... yes
    checking how to run the C++ preprocessor... g++ -E
    checking whether g++ supports -frepo... yes
    not using lib directory suffix
    checking for ld used by GCC... /usr/bin/ld
    checking if the linker (/usr/bin/ld) is GNU ld... yes
    checking for /usr/bin/ld option to reload object files... -r
    checking for BSD-compatible nm... /usr/bin/nm -B
    checking for a sed that does not truncate output...
    checking whether ln -s works... yes
    checking how to recognise dependant libraries... pass_all
    checking for egrep... grep -E
    checking for ANSI C header files... yes
    checking for sys/types.h... yes
    checking for sys/stat.h... yes
    checking for stdlib.h... yes
    checking for string.h... yes
    checking for memory.h... yes
    checking for strings.h... yes
    checking for inttypes.h... yes
    checking for stdint.h... yes
    checking for unistd.h... yes
    checking dlfcn.h usability... yes
    checking dlfcn.h presence... yes
    checking for dlfcn.h... yes
    checking the maximum length of command line arguments... 32768
    checking command to parse /usr/bin/nm -B output from gcc object... ok
    checking for objdir... .libs
    checking for ranlib... ranlib
    checking for strip... strip
    checking if gcc static flag works... yes
    checking if gcc supports -fno-rtti -fno-exceptions... no
    checking for gcc option to produce PIC... -fPIC
    checking if gcc PIC flag -fPIC works... yes
    checking if gcc supports -c -o file.o... yes
    checking whether the gcc linker (/usr/bin/ld) supports shared libraries... yes
    checking whether -lc should be explicitly linked in... no
    checking how to hardcode library paths into programs... immediate
    checking whether stripping libraries is possible... yes
    checking dynamic linker characteristics... GNU/Linux ld.so
    checking if libtool supports shared libraries... yes
    checking whether to build shared libraries... yes
    checking whether to build static libraries... no
    configure: creating libtool
    appending configuration tag "CXX" to libtool
    checking whether the g++ linker (/usr/bin/ld) supports shared libraries... yes
    checking for g++ option to produce PIC... -fPIC
    checking if g++ PIC flag -fPIC works... yes
    checking if g++ supports -c -o file.o... yes
    checking whether the g++ linker (/usr/bin/ld) supports shared libraries... yes
    checking whether -lc should be explicitly linked in... yes
    checking how to hardcode library paths into programs... immediate
    checking whether stripping libraries is possible... yes
    checking dynamic linker characteristics... GNU/Linux ld.so
    appending configuration tag "GCJ" to libtool
    checking if gcj supports -fno-rtti -fno-exceptions... (cached) no
    checking for gcj option to produce PIC... -fPIC
    checking if gcj PIC flag -fPIC works... no
    checking if gcj supports -c -o file.o... no
    checking whether the gcj linker (/usr/bin/ld) supports shared libraries... yes
    checking whether -lc should be explicitly linked in... yes
    checking how to hardcode library paths into programs... immediate
    checking whether stripping libraries is possible... yes
    checking dynamic linker characteristics... GNU/Linux ld.so
    checking for msgfmt... /usr/bin/msgfmt
    checking for gmsgfmt... /usr/bin/msgfmt
    checking for xgettext... /usr/bin/xgettext
    checking for main in -lutil... yes
    checking for main in -lcompat... no
    checking for crypt in -lcrypt... yes
    checking for socklen_t... socklen_t
    checking for dnet_ntoa in -ldnet... no
    checking for dnet_ntoa in -ldnet_stub... no
    checking for inet_ntoa... yes
    checking for connect... yes
    checking for remove... yes
    checking for shmat... yes
    checking crt_externs.h usability... no
    checking crt_externs.h presence... no
    checking for crt_externs.h... no
    checking for _NSGetEnviron... no
    checking for sys/types.h... (cached) yes
    checking for stdint.h... (cached) yes
    checking for poll in -lpoll... no
    checking CoreAudio/CoreAudio.h usability... no
    checking CoreAudio/CoreAudio.h presence... no
    checking for CoreAudio/CoreAudio.h... no
    checking for res_init... yes
    checking if res_init needs custom prototype... no
    checking for killpg in -lucb... no
    checking for int... yes
    checking size of int... 4
    checking for long... yes
    checking size of long... 4
    checking for char *... yes
    checking size of char *... 4
    checking for char... yes
    checking size of char... 1
    checking for dlopen in -ldl... yes
    checking for shl_unload in -ldld... no
    checking for vsnprintf... yes
    checking for snprintf... yes
    checking for X... libraries /usr/X11R6/lib, headers /usr/X11R6/include
    checking for IceConnectionNumber in -lICE... yes
    checking for libXext... yes
    checking for Xinerama... no
    checking for pthread_create in -lpthread... yes
    checking for extra includes... no
    checking for extra libs... no
    checking for libz... -lz
    checking for libpng... -lpng -lz -lm
    checking for libjpeg6b... no
    checking for libjpeg... -ljpeg
    checking for Qt... libraries /usr/lib/qt3//lib, headers /usr/lib/qt3//include using -mt
    checking if Qt compiles without flags... no
    checking for moc... /usr/lib/qt3//bin/moc
    checking for uic... /usr/lib/qt3//bin/uic
    checking whether uic supports -L ... yes
    checking whether uic supports -nounload ... yes
    checking if Qt needs -ljpeg... no
    checking for rpath... yes
    checking for KDE... libraries /usr/lib, headers /usr/include
    checking for KDE paths... defaults
    checking for dcopidl... /usr/bin/dcopidl
    checking for dcopidl2cpp... /usr/bin/dcopidl2cpp
    checking for mcopidl... /usr/bin/mcopidl
    checking for artsc-config... /usr/bin/artsc-config
    checking for kde-config... /usr/bin/kde-config
    checking for meinproc... /usr/bin/meinproc
    checking whether byte ordering is bigendian... no
    checking for MAXPATHLEN... 4096
    checking for Python directory... /usr/local
    checking for Python2.3... header no library no modules /usr/lib/python2.3
    checking for Python2.2... header no library no modules no
    checking for Python2.1... header no library no modules no
    checking for Python2.0... header no library no modules no
    checking for Python1.5... header no library no modules no
    checking for libxmms... ./configure: line 1: xmms-config: command not found
    ./configure: line 1: xmms-config: command not found
    no
    checking if doc should be compiled... yes
    checking if po should be compiled... yes
    checking if src should be compiled... yes
    configure: creating ./config.status
    fast creating Makefile
    fast creating doc/Makefile
    fast creating doc/en/Makefile
    fast creating po/Makefile
    fast creating src/Makefile
    config.status: creating config.h
    config.status: config.h is unchanged
    config.status: executing depfiles commands

    Good - your configure finished. Start make now

    [[email protected] super]# make
    make all-recursive
    make[1]: Entering directory `/home/david/Downloads/super'
    Making all in doc
    make[2]: Entering directory `/home/david/Downloads/super/doc'
    Making all in .
    make[3]: Entering directory `/home/david/Downloads/super/doc'
    make[3]: Nothing to be done for `all-am'.
    make[3]: Leaving directory `/home/david/Downloads/super/doc'
    Making all in en
    make[3]: Entering directory `/home/david/Downloads/super/doc/en'
    make[3]: Nothing to be done for `all'.
    make[3]: Leaving directory `/home/david/Downloads/super/doc/en'
    make[2]: Leaving directory `/home/david/Downloads/super/doc'
    Making all in po
    make[2]: Entering directory `/home/david/Downloads/super/po'
    make[2]: Nothing to be done for `all'.
    make[2]: Leaving directory `/home/david/Downloads/super/po'
    Making all in src
    make[2]: Entering directory `/home/david/Downloads/super/src'
    make[3]: Entering directory `/home/david/Downloads/super/src'
    if g++ -DHAVE_CONFIG_H -I. -I. -I.. -I/usr/lib/qt3//include -I/usr/X11R6/include -DQT_THREAD_SUPPORT -D_REENTRANT -Wnon-virtual-dtor -Wno-long-long -Wundef -pedantic -W -Wpointer-arith -Wmissing-prototypes -ansi -D_XOPEN_SOURCE=500 -D_BSD_SOURCE -Wcast-align -Wconversion -O2 -fno-exceptions -fno-check-new -MT main.o -MD -MP -MF ".deps/main.Tpo" \
    -c -o main.o `test -f 'main.cpp' || echo './'`main.cpp; \
    then mv -f ".deps/main.Tpo" ".deps/main.Po"; \
    else rm -f ".deps/main.Tpo"; exit 1; \
    fi
    In file included from main.cpp:5:
    karambaapp.h:14:20: Python.h: No such file or directory
    In file included from main.cpp:19:
    karamba.h:8:20: Python.h: No such file or directory
    In file included from karamba.h:56,
    from main.cpp:19:
    imagelabel.h:26:20: Python.h: No such file or directory
    In file included from main.cpp:22:
    karamba_python.h:28:20: Python.h: No such file or directory
    In file included from main.cpp:22:
    karamba_python.h:44: error: syntax error before `*' token
    karamba_python.h:45: error: syntax error before `*' token
    karamba_python.h:46: error: ISO C++ forbids declaration of `PyThreadState' with no type
    karamba_python.h:46: error: syntax error before `*' token
    karamba_python.h:48: error: `myThreadState' was not declared in this scope
    karamba_python.h:48: error: invalid data member initialization
    karamba_python.h:48: error: (use `=' to initialize static data members)
    karamba_python.h:48: error: variable or field `getLock' declared void
    karamba_python.h:49: error: syntax error before `*' token
    karamba_python.h:50: error: `myThreadState' was not declared in this scope
    karamba_python.h:50: error: invalid data member initialization
    karamba_python.h:50: error: variable or field `releaseLock' declared void
    karamba_python.h:51: error: type specifier omitted for parameter `PyObject'
    karamba_python.h:51: error: syntax error before `*' token
    make[3]: *** [main.o] Error 1
    make[3]: Leaving directory `/home/david/Downloads/super/src'
    make[2]: *** [all-recursive] Error 1
    make[2]: Leaving directory `/home/david/Downloads/super/src'
    make[1]: *** [all-recursive] Error 1
    make[1]: Leaving directory `/home/david/Downloads/super'
    make: *** [all] Error 2
    [[email protected] super]# su
    da[[email protected] super]# ******
    bash: ******: command not found
    [[email protected] super]# make install
    Making install in doc
    make[1]: Entering directory `/home/david/Downloads/super/doc'
    Making install in .
    make[2]: Entering directory `/home/david/Downloads/super/doc'
    make[3]: Entering directory `/home/david/Downloads/super/doc'
    make[3]: Nothing to be done for `install-exec-am'.
    make[3]: Nothing to be done for `install-data-am'.
    make[3]: Leaving directory `/home/david/Downloads/super/doc'
    make[2]: Leaving directory `/home/david/Downloads/super/doc'
    Making install in en
    make[2]: Entering directory `/home/david/Downloads/super/doc/en'
    make[3]: Entering directory `/home/david/Downloads/super/doc/en'
    make[3]: Nothing to be done for `install-exec-am'.
    /bin/sh ../../admin/mkinstalldirs /usr/share/doc/HTML/en/karamba
    mkdir -p -- /usr/share/doc/HTML/en/karamba
    /usr/bin/install -c -p -m 644 index.docbook /usr/share/doc/HTML/en/karamba/index.docbook
    /bin/sh ../../admin/mkinstalldirs /usr/share/doc/HTML/en/karamba
    /usr/bin/install -c -p -m 644 index.cache.bz2 /usr/share/doc/HTML/en/karamba/
    rm -f /usr/share/doc/HTML/en/karamba/common
    ln -s /usr/share/doc/HTML/en/common /usr/share/doc/HTML/en/karamba/common
    make[3]: Leaving directory `/home/david/Downloads/super/doc/en'
    make[2]: Leaving directory `/home/david/Downloads/super/doc/en'
    make[1]: Leaving directory `/home/david/Downloads/super/doc'
    Making install in po
    make[1]: Entering directory `/home/david/Downloads/super/po'
    make[2]: Entering directory `/home/david/Downloads/super/po'
    make[2]: Nothing to be done for `install-exec-am'.
    make[2]: Nothing to be done for `install-data-am'.
    make[2]: Leaving directory `/home/david/Downloads/super/po'
    make[1]: Leaving directory `/home/david/Downloads/super/po'
    Making install in src
    make[1]: Entering directory `/home/david/Downloads/super/src'
    make[2]: Entering directory `/home/david/Downloads/super/src'
    if g++ -DHAVE_CONFIG_H -I. -I. -I.. -I/usr/lib/qt3//include -I/usr/X11R6/include -DQT_THREAD_SUPPORT -D_REENTRANT -Wnon-virtual-dtor -Wno-long-long -Wundef -pedantic -W -Wpointer-arith -Wmissing-prototypes -ansi -D_XOPEN_SOURCE=500 -D_BSD_SOURCE -Wcast-align -Wconversion -O2 -fno-exceptions -fno-check-new -MT main.o -MD -MP -MF ".deps/main.Tpo" \
    -c -o main.o `test -f 'main.cpp' || echo './'`main.cpp; \
    then mv -f ".deps/main.Tpo" ".deps/main.Po"; \
    else rm -f ".deps/main.Tpo"; exit 1; \
    fi
    In file included from main.cpp:5:
    karambaapp.h:14:20: Python.h: No such file or directory
    In file included from main.cpp:19:
    karamba.h:8:20: Python.h: No such file or directory
    In file included from karamba.h:56,
    from main.cpp:19:
    imagelabel.h:26:20: Python.h: No such file or directory
    In file included from main.cpp:22:
    karamba_python.h:28:20: Python.h: No such file or directory
    In file included from main.cpp:22:
    karamba_python.h:44: error: syntax error before `*' token
    karamba_python.h:45: error: syntax error before `*' token
    karamba_python.h:46: error: ISO C++ forbids declaration of `PyThreadState' with no type
    karamba_python.h:46: error: syntax error before `*' token
    karamba_python.h:48: error: `myThreadState' was not declared in this scope
    karamba_python.h:48: error: invalid data member initialization
    karamba_python.h:48: error: (use `=' to initialize static data members)
    karamba_python.h:48: error: variable or field `getLock' declared void
    karamba_python.h:49: error: syntax error before `*' token
    karamba_python.h:50: error: `myThreadState' was not declared in this scope
    karamba_python.h:50: error: invalid data member initialization
    karamba_python.h:50: error: variable or field `releaseLock' declared void
    karamba_python.h:51: error: type specifier omitted for parameter `PyObject'
    karamba_python.h:51: error: syntax error before `*' token
    make[2]: *** [main.o] Error 1
    make[2]: Leaving directory `/home/david/Downloads/super/src'
    make[1]: *** [install-recursive] Error 1
    make[1]: Leaving directory `/home/david/Downloads/super/src'
    make: *** [install-recursive] Error 1


    mi sembra che sia andato tutto storto, ma come si fa a far partire karamba?

  2. #2
    Utente GNU/Linux
    Registrato il
    10-02
    LocalitÓ
    Roma
    Messaggi
    3.246
    # urpmi karamba ?

  3. #3
    Fighting with Mandrake L'avatar di Dark Ares
    Registrato il
    01-04
    LocalitÓ
    Russia
    Messaggi
    864
    nessun pacchetto denominato karamba

  4. #4
    Utente GNU/Linux
    Registrato il
    10-02
    LocalitÓ
    Roma
    Messaggi
    3.246
    Evidentemente non hai aggiunto (correttamente) la sorgente contrib , se vuoi aiutati con Easy Urpmi.

  5. #5
    Fighting with Mandrake L'avatar di Dark Ares
    Registrato il
    01-04
    LocalitÓ
    Russia
    Messaggi
    864
    ho re-installato urpmi da capo e si, ho trovato karamba. Cmq e' la versione 17 e io ho trovato l'rpm di superkaramba su un sito. Grazie lo stesso

Regole di Scrittura

  • Tu non puoi inviare nuove discussioni
  • Tu non puoi inviare risposte
  • Tu non puoi inviare allegati
  • Tu non puoi modificare i tuoi messaggi
  •